{"text_format":"1","workbook":"xlsx","n_sheets":4,"sheets":["RSCS","Int6","Int7","Int12"],"not_rendered":{"charts":6,"images":7,"macros":1,"external_links":0,"defined_names":0,"comments":0,"pivot_tables":0},"unopened":[],"bounds":{"document_bytes":16777216,"sheet_cells":100000,"rows_first":2000,"rows_last":500,"rows_between":2000,"halvings":0,"cell_chars":16384,"cell_head_chars":4096},"cells_cut":0,"cells_raw":0,"read":"whole","date_system":"1900"}

{"sheet":"RSCS","index":0,"n_rows":612,"n_cols":90,"rows_kept":612,"cut":false,"hidden":false,"merged":[[33,5,37,6],[28,1,29,1],[28,3,29,3],[26,5,27,5],[8,1,9,2],[11,1,12,2],[26,1,27,1],[24,1,25,1],[24,3,25,3],[20,1,21,1],[18,1,19,1],[20,3,21,3],[18,5,19,5]]}
[]
[]
[]
[]
[]
[]
[null,"  Input Parameters:"]
[]
[null," Passing Sieve #4"]
[]
[]
[null," Passing Sieve #200"]
[]
[]
[]
[null," Sand Fraction FS:"]
[null,"emin",null,"emax"]
[]
[null,"or",null,null,null,"Cc"]
[]
[null,"Cu",null,"R"]
[]
[]
[null," Gravel Fraction FG:"]
[null,"emin",null,"emax"]
[]
[null,"or",null,null,null,"Cc"]
[]
[null,"Cu",null,"R"]
[]
[]
[null," Fines Fraction FF:"]
[null,null,"LLdw"]
[null,null,null,null,null,"Please fill white boxes to provide soil classification "]
[null,null,"LLker"]
[]
[null,null,"LLbrine"]
[]
[]
[]
[]
[]
[]
[]
[]
[]
[]
[]
[]
[]
[]
[]
[]
[]
[]
[]
[]
[]
[]
[]
[]
[]
[]
[]
[]
[]
[]
[]
[]
[]
[]
[]
[]
[]
[]
[]
[]
[]
[]
[]
[]
[]
[]
[]
[]
[]
[]
[]
[]
[]
[]
[]
[]
[]
[]
[]
[]
[]
[]
[]
[]
[]
[]
[]
[]
[]
[]
[]
[]
[]
[]
[]
[]
[]
[]
[]
[]
[]
[]
[]
[]
[]
[]
[]
[]
[]
[]
[]
[]
[]
[]
[]
[]
[]
[]
[]
[]
[]
[]
[]
[]
[]
[]
[]
[]
[]
[]
[]
[]
[]
[]
[]
[]
[]
[]
[]
[]
[]
[]
[]
[]
[]
[]
[]
[]
[]
[]
[]
[]
[]
[]
[]
[]
[]
[]
[]
[]
[]
[]
[]
[]
[]
[]
[]
[]
[]
[]
[]
[]
[]
[]
[]
[]
[]
[]
[]
[]
[]
[]
[]
[]
[]
[]
[]
[]
[]
[]
[]
[]
[]
[]
[]
[]
[]
[]
[]
[]
[]
[]
[]
[]
[]
[]
[]
[]
[]
[]
[]
[]
[]
[]
[]
[]
[]
[]
[]
[]
[]
[]
[]
[]
[]
[]
[]
[]
[]
[]
[]
[]
[]
[]
[]
[]
[]
[]
[]
[]
[]
[]
[]
[]
[]
[]
[]
[]
[]
[]
[]
[]
[]
[]
[]
[]
[]
[]
[]
[]
[]
[]
[]
[]
[]
[]
[]
[]
[]
[]
[]
[]
[]
[]
[]
[]
[]
[]
[]
[]
[]
[]
[]
[]
[]
[]
[]
[]
[]
[]
[]
[]
[]
[]
[]
[]
[]
[]
[]
[]
[]
[]
[]
[]
[]
[]
[]
[]
[]
[]
[]
[]
[]
[]
[]
[]
[]
[]
[]
[]
[]
[]
[]
[]
[]
[]
[]
[]
[]
[]
[]
[]
[]
[]
[]
[]
[]
[]
[]
[]
[]
[]
[]
[]
[]
[]
[]
[]
[]
[]
[]
[]
[]
[]
[]
[]
[]
[]
[]
[]
[]
[]
[]
[]
[]
[]
[]
[]
[]
[]
[]
[]
[]
[]
[]
[]
[]
[]
[]
[]
[]
[]
[]
[]
[]
[]
[]
[]
[]
[]
[]
[]
[]
[]
[]
[]
[]
[]
[]
[]
[]
[]
[]
[]
[]
[]
[]
[]
[]
[]
[]
[]
[]
[]
[]
[]
[]
[]
[]
[]
[]
[]
[]
[]
[]
[]
[]
[]
[]
[]
[]
[]
[]
[]
[]
[]
[]
[]
[]
[]
[]
[]
[]
[]
[]
[]
[]
[]
[]
[]
[]
[]
[]
[]
[]
[]
[]
[]
[]
[]
[]
[]
[]
[]
[]
[]
[]
[]
[]
[]
[]
[]
[]
[]
[]
[]
[]
[]
[]
[]
[]
[]
[]
[]
[]
[]
[]
[]
[]
[]
[]
[]
[]
[]
[]
[]
[]
[]
[]
[]
[]
[]
[]
[]
[]
[]
[]
[]
[]
[]
[]
[]
[]
[]
[]
[]
[]
[]
[]
[]
[]
[]
[]
[]
[]
[]
[]
[]
[]
[]
[]
[]
[]
[]
[]
[]
[]
[]
[]
[]
[]
[]
[]
[]
[]
[]
[]
[]
[]
[]
[]
[]
[]
[]
[]
[]
[]
[]
[]
[]
[]
[]
[]
[]
[]
[]
[]
[]
[]
[]
[]
[]
[]
[]
[]
[]
[]
[]
[]
[]
[]
[]
[]
[]
[]
[]
[null,null,null,null,1,1]
[]
[null,null,null,null,0,0,null,null,null,null,null,null,null,null,null,null,null,null,null,null,null,null,null,null,null,null,null,null,null,null,null,null,null,null,null,null,null,null,null,null,null,null,null,null,null,null,null,null,null,null,null,null,null,null,null,null,null,null,null,null,null,null,null,null,null,null,null,null,null,null,null,null,null,null,null,null,null,null,null,null,null,null,null,null,null,null,null,null,0,0]
[]
[]
[]
[]
[null,null,null,null,null,0,0]
[null,null,null,null,null,0,0]

{"sheet":"Int6","index":1,"n_rows":161,"n_cols":16,"rows_kept":161,"cut":false,"hidden":true,"merged":[[110,1,110,2],[98,1,98,2],[107,10,107,15],[108,10,108,11],[14,2,15,4],[18,2,19,3],[106,5,106,6],[107,1,107,2]]}
[]
[]
[]
[]
[]
[]
[]
[]
[]
[]
[]
[]
[]
[]
[]
[]
[]
[]
[]
[]
[]
[]
[]
[]
[]
[]
[]
[]
[]
[]
[]
[]
[]
[]
[]
[]
[]
[]
[]
[]
[]
[]
[]
[]
[]
[]
[]
[]
[]
[]
[]
[]
[]
[]
[]
[]
[]
[]
[]
[]
[]
[]
[]
[]
[]
[]
[]
[]
[]
[]
[]
[]
[]
[]
[]
[]
[]
[]
[]
[]
[]
[]
[]
[]
[]
[]
[]
[]
[]
[]
[]
[]
[]
[]
[]
[]
[]
[]
[null,"LL corrected",null,null,null,null,null,"Llker","Llbrine","LLdw"]
[null,null,null,null,null,null,null,55,70,60]
[null,{"$f":"(H100/I100)*((1-0.11688*(I100/100))/0.8)","v":0.90178785714285703},{"$f":"(J100/I100)*(1-0.11688*(I100/100))","v":0.78701485714285713}]
[]
[null,{"$f":"IF(B101>=1,\"LLker/LLbri\",\"LLbri/LLker\")","v":"LLbri/LLker"},{"$f":"IF(C101>=1,\"LLdw/LLbri\",\"Llbri/LLdw\")","v":"Llbri/LLdw"}]
[null,{"$f":"IF(B101>=1,B101,(B101^(-1)))","v":1.1089082560595898},{"$f":"IF(C101>=1,C101,(C101^(-1)))","v":1.2706240434016132},{"$f":"(((B104-1)^2)+((C104-1)^2))^(1/2)","v":0.29171626815277096},{"$f":"I100/(1-0.11688*I100/100)","v":76.237442604096785}]
[null,null,null,null,null,null,null,null,null,null,null,null,null,"CHART #1"]
[]
[null,null,null,null,null,"Fine Classification",null,null,null,null,null,null,0.02,null,0.04]
[null,"PLOT #1",null,null,null,{"$f":"IF(D104>1,\"High Electrical Sensitivity\",IF(D104>0.4,\"Intermedial Electrical Sensitivity\",\"Low Electrical Sensitivity\"))","v":"Low Electrical Sensitivity"},{"$f":"IF(E104>75,\"High plasticity\",IF(E104>50,\"Intermedium plasticity\",IF(E104>30,\"Low plasticy\",\"Non plastic\")))","v":"High plasticity"},null,null,null,"Circules plots"]
[null,"X","Y",null,null,{"$f":"IF(D104>1,\"H\",IF(D104>0.4,\"I\",\"L\"))","v":"L"},{"$f":"IF(E104>75,\"H\",IF(E104>50,\"I\",IF(E104>30,\"L\",\"N\")))","v":"H"},null,null,null,"Lines",null,"x","y","x","y"]
[null,{"$f":"IF(B101>1,2-B101,((B101)^-1))","v":1.1089082560595898},{"$f":"C104","v":1.2706240434016132},null,null,null,null,null,null,null,-1,1,0.6,{"$f":"SQRT(0.4^2-(1-M110)^2)+1","v":1},0,{"$f":"SQRT(1^2-(1-O110)^2)+1","v":1}]
[null,"PLOT #2",null,null,null,null,null,null,null,null,3,1,{"$f":"M110+M$107","v":0.62},1.1248999599679681,0.02,{"$f":"SQRT(1^2-(1-O111)^2)+1","v":1.1989974874213243}]
[null,"X","Y",null,null,null,null,null,null,null,null,null,0.64,1.1743559577416272,{"$f":"O111+O$107","v":0.06},1.3411744421846397]
[null,{"$f":"I100/(1-0.11688*I100/100)","v":76.237442604096785},{"$f":"D104","v":0.29171626815277096},null,null,null,null,null,null,null,1,0,0.66,1.2107130750570549,0.1,1.4358898943540672]
[null,null,null,null,null,null,null,null,null,null,1,6,0.68,1.2400000000000002,0.14000000000000001,1.510294032886923]
[null,null,null,null,null,null,null,null,null,null,null,null,0.70000000000000007,1.2645751311064592,0.18000000000000002,1.5723635208501676]
[null,null,null,null,null,null,null,null,null,null,null,null,0.72000000000000008,1.285657137141714,0.22000000000000003,1.6257795138864806]
[null,null,null,null,null,null,null,null,null,null,null,null,0.7400000000000001,{"$f":"SQRT(0.4^2-(1-M117)^2)+1","v":1.3039736830714135},0.26,1.6726068688320095]
[null,null,null,null,null,null,null,null,null,null,null,null,0.76000000000000012,1.32,0.3,1.7141428428542849]
[null,null,null,null,null,null,null,null,null,null,null,null,0.78000000000000014,1.3340658617698016,0.33999999999999997,1.7512655988397179]
[null,null,null,null,null,null,null,null,null,null,null,null,0.80000000000000016,1.3464101615137756,0.37999999999999995,1.7846018098373211]
[null,null,null,null,null,null,null,null,null,null,null,null,0.82000000000000017,1.3572114219898352,0.41999999999999993,1.8146164741766522]
[null,null,null,null,null,null,null,null,null,null,null,null,0.84000000000000019,1.3666060555964674,0.45999999999999991,1.8416650165000323]
[null,null,null,null,null,null,null,null,null,null,null,null,0.86000000000000021,1.3746998799039041,0.49999999999999989,1.8660254037844386]
[null,null,null,null,null,null,null,null,null,null,null,null,0.88000000000000023,1.3815756805667783,0.53999999999999992,1.8879189152169245]
[null,null,null,null,null,null,null,null,null,null,null,null,0.90000000000000024,1.3872983346207417,0.57999999999999996,1.9075241043630742]
[null,null,null,null,null,null,null,null,null,null,null,null,0.92000000000000026,1.3919183588453086,0.62,1.9249864863877741]
[null,null,null,null,null,null,null,null,null,null,null,null,0.94000000000000028,1.3954743986657039,0.66,1.9404254356406998]
[null,null,null,null,null,null,null,null,null,null,null,null,0.9600000000000003,1.3979949748426481,0.70000000000000007,1.9539392014169457]
[null,null,null,null,null,null,null,null,null,null,null,null,0.98000000000000032,1.3994996871087637,0.7400000000000001,1.965608616365865]
[null,null,null,null,null,null,null,null,null,null,null,null,1.0000000000000002,1.4,0.78000000000000014,1.9754998718605759]
[null,null,null,null,null,null,null,null,null,null,null,null,1.0200000000000002,1.3994996871087637,0.82000000000000017,1.9836666101886351]
[null,null,null,null,null,null,null,null,null,null,null,null,1.0400000000000003,1.3979949748426481,0.86000000000000021,1.9901515035589252]
[null,null,null,null,null,null,null,null,null,null,null,null,1.0600000000000003,1.3954743986657037,0.90000000000000024,1.9949874371066199]
[null,null,null,null,null,null,null,null,null,null,null,null,1.0800000000000003,1.3919183588453086,0.94000000000000028,1.9981983770774225]
[null,null,null,null,null,null,null,null,null,null,null,null,1.1000000000000003,1.3872983346207417,0.98000000000000032,1.9997999799959989]
[null,null,null,null,null,null,null,null,null,null,null,null,1.1200000000000003,1.3815756805667783,1.0200000000000002,1.9997999799959989]
[null,null,null,null,null,null,null,null,null,null,null,null,1.1400000000000003,1.3746998799039039,1.0600000000000003,1.9981983770774225]
[null,null,null,null,null,null,null,null,null,null,null,null,1.1600000000000004,1.366606055596467,1.1000000000000003,1.9949874371066199]
[null,null,null,null,null,null,null,null,null,null,null,null,1.1800000000000004,1.3572114219898348,1.1400000000000003,1.990151503558925]
[null,null,null,null,null,null,null,null,null,null,null,null,1.2000000000000004,1.3464101615137753,1.1800000000000004,1.9836666101886351]
[null,null,null,null,null,null,null,null,null,null,null,null,1.2200000000000004,1.3340658617698011,1.2200000000000004,1.9754998718605759]
[null,null,null,null,null,null,null,null,null,null,null,null,1.2400000000000004,1.3199999999999998,1.2600000000000005,1.9656086163658648]
[null,null,null,null,null,null,null,null,null,null,null,null,1.2600000000000005,1.3039736830714128,1.3000000000000005,1.9539392014169454]
[null,null,null,null,null,null,null,null,null,null,null,null,1.2800000000000005,1.2856571371417136,{"$f":"O143+O$107","v":1.3400000000000005},1.9404254356406996]
[null,null,null,null,null,null,null,null,null,null,null,null,1.3000000000000005,1.2645751311064586,1.3800000000000006,1.9249864863877741]
[null,null,null,null,null,null,null,null,null,null,null,null,1.3200000000000005,1.2399999999999993,1.4200000000000006,1.9075241043630737]
[null,null,null,null,null,null,null,null,null,null,null,null,1.3400000000000005,1.2107130750570541,1.4600000000000006,1.8879189152169242]
[null,null,null,null,null,null,null,null,null,null,null,null,1.3600000000000005,1.1743559577416258,1.5000000000000007,1.8660254037844384]
[null,null,null,null,null,null,null,null,null,null,null,null,1.3800000000000006,1.1248999599679663,1.5400000000000007,1.8416650165000321]
[null,null,null,null,null,null,null,null,null,null,null,null,1.4000000000000006,1,1.5800000000000007,1.8146164741766515]
[null,null,null,null,null,null,null,null,null,null,null,null,null,null,1.6200000000000008,1.7846018098373206]
[null,null,null,null,null,null,null,null,null,null,null,null,null,null,1.6600000000000008,1.7512655988397172]
[null,null,null,null,null,null,null,null,null,null,null,null,null,null,1.7000000000000008,1.7141428428542842]
[null,null,null,null,null,null,null,null,null,null,null,null,null,null,1.7400000000000009,1.6726068688320086]
[null,null,null,null,null,null,null,null,null,null,null,null,null,null,1.7800000000000009,1.6257795138864797]
[null,null,null,null,null,null,null,null,null,null,null,null,null,null,1.820000000000001,1.5723635208501661]
[null,null,null,null,null,null,null,null,null,null,null,null,null,null,1.860000000000001,1.5102940328869212]
[null,null,null,null,null,null,null,null,null,null,null,null,null,null,1.900000000000001,1.4358898943540652]
[null,null,null,null,null,null,null,null,null,null,null,null,null,null,1.9400000000000011,1.3411744421846368]
[null,null,null,null,null,null,null,null,null,null,null,null,null,null,1.9800000000000011,1.1989974874213187]
[null,null,null,null,null,null,null,null,null,null,null,null,null,null,2.0200000000000009,1]

{"sheet":"Int7","index":2,"n_rows":103,"n_cols":14,"rows_kept":103,"cut":false,"hidden":true,"merged":[[87,12,87,22],[88,12,88,13],[14,2,15,4],[18,2,19,3]]}
[]
[]
[]
[]
[]
[]
[]
[]
[]
[]
[]
[]
[]
[]
[]
[]
[]
[]
[]
[]
[]
[]
[]
[]
[]
[]
[]
[]
[]
[]
[]
[]
[]
[]
[]
[]
[]
[]
[]
[]
[]
[]
[]
[]
[]
[]
[]
[]
[]
[]
[]
[]
[]
[]
[]
[]
[]
[]
[]
[]
[]
[]
[]
[]
[]
[]
[]
[]
[]
[]
[]
[]
[]
[]
[]
[]
[]
[]
[]
[]
[]
[]
[]
[]
[]
[]
[]
[null,null,null,null,null,null,null,null,null,null,null,null,"CHART#2"]
[null,null,null,null,null,null,null,null,null,null,null,null,"boundaries"]
[null,null,null,null,null,null,null,null,null,null,null,null,0,0.4]
[null,null,null,null,null,null,null,null,null,null,null,null,200,0.4]
[]
[null,null,null,null,null,null,null,null,null,null,null,null,0,1]
[null,null,null,null,null,null,null,null,null,null,null,null,200,1]
[]
[null,null,null,null,null,null,null,null,null,null,null,null,30,0]
[null,null,null,null,null,null,null,null,null,null,null,null,30,4.5]
[]
[null,null,null,null,null,null,null,null,null,null,null,null,50,0]
[null,null,null,null,null,null,null,null,null,null,null,null,50,4.5]
[]
[null,null,null,null,null,null,null,null,null,null,null,null,75,0]
[null,null,null,null,null,null,null,null,null,null,null,null,75,4.5]

{"sheet":"Int12","index":3,"n_rows":190,"n_cols":47,"rows_kept":190,"cut":false,"hidden":true,"merged":[[138,44,139,44],[140,44,141,44],[142,44,143,44],[144,44,145,44],[146,44,147,44],[154,43,155,43],[154,42,155,42],[156,42,157,42],[156,43,157,43],[148,44,149,44],[150,44,151,44],[152,44,153,44],[154,44,155,44],[156,44,157,44],[152,43,153,43],[152,42,153,42],[142,42,143,42],[144,42,145,42],[146,42,147,42],[148,42,149,42],[150,42,151,42],[142,43,143,43],[144,43,145,43],[146,43,147,43],[148,43,149,43],[150,43,151,43],[136,38,136,39],[136,40,136,41],[138,42,139,42],[138,43,139,43],[140,42,141,42],[140,43,141,43],[128,17,129,17],[128,18,128,19],[128,20,128,21],[128,22,128,23],[14,2,15,4],[18,2,19,3],[103,21,103,22],[103,23,103,24],[113,17,114,17],[113,18,113,19],[113,20,113,21],[113,22,113,23]]}
[]
[]
[]
[]
[]
[]
[]
[]
[]
[]
[]
[]
[]
[]
[]
[]
[]
[]
[]
[]
[]
[]
[]
[]
[]
[]
[]
[]
[]
[]
[]
[]
[]
[]
[]
[]
[]
[]
[]
[]
[]
[]
[]
[]
[]
[]
[]
[]
[]
[]
[]
[]
[]
[]
[]
[]
[]
[]
[]
[]
[]
[]
[]
[]
[]
[]
[]
[]
[]
[]
[]
[]
[]
[]
[]
[]
[]
[]
[]
[]
[]
[]
[]
[]
[]
[]
[]
[]
[]
[]
[]
[]
[]
[]
[]
[null,null,null,null,null,null,null,null,null,null,null,null,null,null,null,null,null,"Plot_Soil ","X","Y"]
[null,null,null,null,null,null,null,null,null,null,null,null,null,null,null,null,null,null,{"$f":"IF($T$101=\"\", \"\",$T$101 +$R$101/2)","v":85},{"$f":"IF($R$101=\"\", \"\", SQRT(3)/2*$R$101)","v":0}]
[]
[]
[null,null,null,null,null,null,null,null,null,null,null,null,null,null,null,null,null,null,"G[%]","S[%]",null,"eGmax","eGmin","eSmax","eSmin",null,"LL[%]"]
[null,null,null,null,null,null,null,null,null,null,null,null,null,null,null,null,null,0,15,85,null,0.82,0.44,0.71,0.4,null,44]
[null,null,null,null,null,null,null,null,null,null,null,null,null,null,null,null,null,null,null,null,null,null,null,null,null,null,null,null,null,null,null,{"$f":"IF(AA101<27,\"\",S(F))","v":{"$error":"#NAME?"}}]
[]
[null,null,null,null,null,null,null,null,null,null,null,null,null,null,null,null,null,null,null,null,null,"GRAVEL",null,"SAND",null,null,"eF|LL","eF|10kPa","eF|1MPa"]
[null,null,null,null,null,null,null,null,null,null,null,null,null,null,null,null,null,null,null,null,null,"R","Cu","R","Cu",null,{"$f":"2.65/100*AA101","v":1.1659999999999999},{"$f":"0.0265*AA101","v":1.1659999999999999},{"$f":"0.011*AA101+0.21","v":0.69399999999999995}]
[null,null,null,null,null,null,null,null,null,null,null,null,null,null,null,null,null,null,null,null,null,0.3,2,0.3,2]
[]
[]
[]
[null,null,null,null,null,null,null,null,null,null,null,null,null,null,null,null,null,null,null,null,null,null,null,null,null,null,null,null,null,null,null,null,"a",0,100,{"$f":"AH110+AI110/2","v":50},{"$f":"SQRT(3)/2*AI110","v":86.602540378443862}]
[null,null,null,null,null,null,null,null,null,null,null,null,null,null,null,null,null,null,null,null,null,null,null,null,null,null,null,null,null,null,null,null,"b",0,0,{"$f":"AH111+AI111/2","v":0},{"$f":"SQRT(3)/2*AI111","v":0}]
[null,null,null,null,null,null,null,null,null,null,null,null,null,null,null,null,null,"Load-carrying fraction",null,null,null,null,null,null,null,null,null,null,null,null,null,null,"c",100,0,{"$f":"AH112+AI112/2","v":100},{"$f":"AI112*SQRT(3)/2","v":0}]
[]
[null,null,null,null,null,null,null,null,null,null,null,null,null,null,null,null,null,"Packing","Gravel",null,"Sand",null,"Fines",null,null,null,"Void ratio",null,null,null,null,null,null,null,null,"Plot"]
[null,null,null,null,null,null,null,null,null,null,null,null,null,null,null,null,null,null,"emax","emin","emax","emin","e10kPa","e1MPa",null,null,"G","S","F",null,null,"G","S","F",null,"X","Y"]
[null,null,null,null,null,null,null,null,null,null,null,null,null,null,null,null,null,"①",null,{"$f":"$W$101","v":0.44},null,null,{"$f":"$AB$105","v":1.1659999999999999},null,null,"[1]",{"$f":"T116","v":0.44},"-",{"$f":"W116","v":1.1659999999999999},null,"[1]",{"$f":"100-AH116","v":83.115886415963161},0,{"$f":"100*AA116/(1+AA116+AC116)","v":16.884113584036839},"[1]",{"$f":"IF(AG116=\"\", \"\", AG116 +AH116/2)","v":8.4420567920184197},{"$f":"IF(AH116=\"\", \"\", SQRT(3)/2*AH116)","v":14.622071284157828},null,null,"F(F)",{"$f":"(AJ110+AJ122+AJ124+AJ123)/4","v":50.731112283779233},{"$f":"(AK110+AK123+AK124+AK122)/4","v":42.399983801882016}]
[null,null,null,null,null,null,null,null,null,null,null,null,null,null,null,null,null,"②",null,{"$f":"$W$101","v":0.44},{"$f":"$X$101","v":0.71},null,null,null,null,"[2]",{"$f":"T117","v":0.44},{"$f":"U117","v":0.71},"-",null,"[2]",{"$f":"100-AG117","v":79.534883720930225},{"$f":"100*AA117/(1+AA117+AB117)","v":20.465116279069768},0,"[2]",20.465116279069768,0]
[null,null,null,null,null,null,null,null,null,null,null,null,null,null,null,null,null,"③",null,0.44,{"$f":"$X$101","v":0.71},null,{"$f":"$AB$105","v":1.1659999999999999},null,null,"[3]",{"$f":"T118","v":0.44},{"$f":"U118","v":0.71},{"$f":"W118","v":1.1659999999999999},null,"[3]",{"$f":"100/(1+AA118/(1+AB118)+(AA118/(1+AC118))*(1-1/(1+AB118)))","v":74.534843941802677},{"$f":"100*(AA118/(1+AB118))/(1+AA118/(1+AB118)+(AA118/(1+AC118))*(1-1/(1+AB118)))","v":19.178556335902442},{"$f":"(100-AF118-AG118)","v":6.2865997222948806},"[3]",22.321856197049883,5.4443550629315638,null,null,"GF(F)",{"$f":"(AJ116+AJ118+AJ122+AJ124)/4","v":25.330764585306909},{"$f":"(AK116+AK118+AK122+AK124)/4","v":18.129907838053363}]
[null,null,null,null,null,null,null,null,null,null,null,null,null,null,null,null,null,"④",null,null,null,{"$f":"$Y$101","v":0.4},{"$f":"$AB$105","v":1.1659999999999999},null,null,"[4]","-",{"$f":"V119","v":0.4},{"$f":"W119","v":1.1659999999999999},null,"[4]",0,{"$f":"100-AH119","v":84.41153546375682},{"$f":"100*AB119/(1+AB119+AC119)","v":15.588464536243182},"[4]",92.20576773187841,13.500006294379403,null,null,"G(F)",{"$f":"(AJ116+AJ118+AJ131+AJ132)/4","v":14.310965082766954},{"$f":"(AK116+AK118+AK131+AK132)/4","v":7.9330767648415881}]
[null,null,null,null,null,null,null,null,null,null,null,null,null,null,null,null,"G-S axis","⑤",{"$f":"2.5*$V$101","v":2.0499999999999998},null,null,{"$f":"$Y$101","v":0.4},null,null,null,"[5]",{"$f":"S120","v":2.0499999999999998},{"$f":"V120","v":0.4},"-",null,"[5]",{"$f":"100-AG120","v":40.579710144927539},{"$f":"100*AA120/(1+AA120+AB120)","v":59.420289855072461},0,"[5]",59.420289855072461,0,null,null,"G(G)",{"$f":"(AJ111+AJ131+AJ117+AJ132)/4","v":11.73626590526732},{"$f":"(AK111+AK131+AK132+AK117)/4","v":2.9164701780692406}]
[null,null,null,null,null,null,null,null,null,null,null,null,null,null,null,null,"G-S-F (2)","⑥",{"$f":"2.5*$V$101","v":2.0499999999999998},null,null,0.4,{"$f":"$AB$105","v":1.1659999999999999},null,null,"[6]",{"$f":"S121","v":2.0499999999999998},{"$f":"V121","v":0.4},{"$f":"W121","v":1.1659999999999999},null,"[6]",{"$f":"100/(1+AA121/(1+AB121)+(AA121/(1+AC121))*(1-1/(1+AB121)))","v":36.567101185379911},{"$f":"100*(AA121/(1+AB121))/(1+AA121/(1+AB121)+(AA121/(1+AC121))*(1-1/(1+AB121)))","v":53.544683878592011},{"$f":"(100-AF121-AG121)","v":9.8882149360280778},"[6]",58.48879134660605,8.5634453326810327]
[null,null,null,null,null,null,null,null,null,null,null,null,null,null,null,null,"G-F axis","⑦",{"$f":"1.3*$V$101","v":1.0660000000000001},null,null,null,null,{"$f":"$AC$105","v":0.69399999999999995},null,"[7]",{"$f":"S122","v":1.0660000000000001},"-",{"$f":"X122","v":0.69399999999999995},null,"[7]",{"$f":"100-AH122","v":61.376811594202891},0,{"$f":"100*AA122/(1+AA122+AC122)","v":38.623188405797109},"[7]",19.311594202898554,33.448662334572887,null,null,"SF(F)",{"$f":"(AJ119+AJ121+AJ123+AJ124)/4","v":71.076853502675718},{"$f":"(AK119+AK121+AK123+AK124)/4","v":17.90304603039294}]
[null,null,null,null,null,null,null,null,null,null,null,null,null,null,null,null,"S-F axis","⑧",null,null,{"$f":"1.3*$X$101","v":0.92299999999999993},null,null,{"$f":"$AC$105","v":0.69399999999999995},null,"[8]","-",{"$f":"U123","v":0.92299999999999993},{"$f":"X123","v":0.69399999999999995},null,"[8]",0,{"$f":"100-AH123","v":64.730607565915165},{"$f":"100*AB123/(1+AB123+AC123)","v":35.269392434084828},"[8]",82.365303782957582,30.544189823960139,null,null,"S(F)",{"$f":"(AJ119+AJ121+AJ133+AJ134)/4","v":76.255042615248541},{"$f":"(AK119+AK121+AK133+AK134)/4","v":8.7116590196078132}]
[null,null,null,null,null,null,null,null,null,null,null,null,null,null,null,null,"G-S-F","⑨",{"$f":"2.5*$V$101","v":2.0499999999999998},null,{"$f":"1.3*$X$101","v":0.92299999999999993},null,null,0.69399999999999995,null,"[9]",{"$f":"S124","v":2.0499999999999998},{"$f":"U124","v":0.92299999999999993},{"$f":"X124","v":0.69399999999999995},null,"[9]",{"$f":"100/(1+AA124/(1+AB124)+(AA124/(1+AC124))*(1-1/(1+AB124)))","v":37.780171024070761},{"$f":"100*(AA124/(1+AB124))/(1+AA124/(1+AB124)+(AA124/(1+AC124))*(1-1/(1+AB124)))","v":40.275273322592334},{"$f":"(100-AF124-AG124)","v":21.944555653336906},"[9]",51.247551149260786,19.004542670551178,null,null,"S(S)",{"$f":"(AJ112+AJ120+AJ133+AJ134)/4","v":78.436475309395533},{"$f":"(AK112+AK120+AK133+AK134)/4","v":3.1957961128427028}]
[]
[null,null,null,null,null,null,null,null,null,null,null,null,null,null,null,null,null,null,null,null,null,null,null,null,null,null,null,null,null,null,null,null,null,null,null,null,null,null,null,"GSF(F)",{"$f":"(AJ118+AJ121+AJ124)/3","v":44.01939956430558},{"$f":"(AK118+AK121+AK124)/3","v":11.004114355387925}]
[null,null,null,null,null,null,null,null,null,null,null,null,null,null,null,null,null,"Fluid flow controllling fraction"]
[null,null,null,null,null,null,null,null,null,null,null,null,null,null,null,null,null,null,null,null,"eF=λeF|LL","λ =",{"$f":"IF(AA101>27, 2*LOG($AA$101-25),1)","v":2.5575072019056577},null,null,null,null,null,null,null,null,null,null,null,null,null,null,null,null,"GS(S)",{"$f":"(AJ117+AJ120+AJ132+AJ133)/4","v":40.06999272756255},{"$f":"(AK117+AK120+AK132+AK133)/4","v":1.981699819791749}]
[null,null,null,null,null,null,null,null,null,null,null,null,null,null,null,null,null,"Packing","Gravel",null,"Sand",null,"Fines",null,null,null,"Void ratio",null,null,null,null,null,null,null,null,"Plot",null,null,null,"GS(F)",{"$f":"(AJ118+AJ121+AJ132+AJ133)/4","v":40.301303079940979},{"$f":"(AK118+AK121+AK132+AK133)/4","v":5.4836499186948977}]
[null,null,null,null,null,null,null,null,null,null,null,null,null,null,null,null,null,null,"emax","emin","emax","emin","eF","e1MPa",null,null,"G","S","F",null,null,"G","S","F",null,"X","Y"]
[null,null,null,null,null,null,null,null,null,null,null,null,null,null,null,null,null,"⑩",null,{"$f":"$W$101","v":0.44},null,null,{"$f":"$W$128*$AA$105","v":2.9820533974219967},null,null,"[10]",{"$f":"T131","v":0.44},"-",{"$f":"W131","v":2.9820533974219967},null,"[10]",{"$f":"100-AH131","v":90.049871395571245},0,{"$f":"100*AA131/(1+AA131+AC131)","v":9.9501286044287625},"[10]",{"$f":"IF(AG131=\"\", \"\", AG131 +AH131/2)","v":4.9750643022143812},{"$f":"IF(AH131=\"\", \"\", SQRT(3)/2*AH131)","v":8.6170641423575116}]
[null,null,null,null,null,null,null,null,null,null,null,null,null,null,null,null,null,"⑪",null,{"$f":"$W$101","v":0.44},{"$f":"$X$101","v":0.71},null,{"$f":"$W$128*$AA$105","v":2.9820533974219967},null,null,"[11]",{"$f":"T132","v":0.44},{"$f":"U132","v":0.71},{"$f":"W132","v":2.9820533974219967},null,"[11]",{"$f":"100/(1+AA132/(1+AB132)+(AA132/(1+AC132))*(1-1/(1+AB132)))","v":76.734881892862077},{"$f":"100*(AA132/(1+AB132))/(1+AA132/(1+AB132)+(AA132/(1+AC132))*(1-1/(1+AB132)))","v":19.74464797243235},{"$f":"(100-AF132-AG132)","v":3.5204701347055725},"[11]",{"$f":"IF(AG132=\"\", \"\", AG132 +AH132/2)","v":21.504883039785135},{"$f":"IF(AH132=\"\", \"\", SQRT(3)/2*AH132)","v":3.0488165699194503}]
[null,null,null,null,null,null,null,null,null,null,null,null,null,null,null,null,null,"⑫",{"$f":"2.5*$V$101","v":2.0499999999999998},null,null,{"$f":"$Y$101","v":0.4},2.9820533974219967,null,null,"[12]",{"$f":"S133","v":2.0499999999999998},{"$f":"V133","v":0.4},{"$f":"W133","v":2.9820533974219967},null,"[12]",{"$f":"100/(1+AA133/(1+AB133)+(AA133/(1+AC133))*(1-1/(1+AB133)))","v":38.29401363339074},{"$f":"100*(AA133/(1+AB133))/(1+AA133/(1+AB133)+(AA133/(1+AC133))*(1-1/(1+AB133)))","v":56.073377106036439},{"$f":"(100-AF133-AG133)","v":5.6326092605728206},"[12]",{"$f":"IF(AG133=\"\", \"\", AG133 +AH133/2)","v":58.889681736322849},{"$f":"IF(AH133=\"\", \"\", SQRT(3)/2*AH133)","v":4.8779827092475454}]
[null,null,null,null,null,null,null,null,null,null,null,null,null,null,null,null,null,"⑬",null,null,null,{"$f":"$Y$101","v":0.4},2.9820533974219967,null,null,"[13]","-",{"$f":"V134","v":0.4},{"$f":"W134","v":2.9820533974219967},null,"[13]",0,{"$f":"(100-AH134)","v":90.871859292373671},{"$f":"100*AB134/(1+AB134+AC134)","v":9.1281407076263328},"[13]",{"$f":"IF(AG134=\"\", \"\", AG134 +AH134/2)","v":95.435929646186835},{"$f":"IF(AH134=\"\", \"\", SQRT(3)/2*AH134)","v":7.9052017421232659}]
[]
[]
[null,null,null,null,null,null,null,null,null,null,null,null,null,null,null,null,null,null,null,null,null,null,null,null,null,null,null,null,null,null,null,null,null,null,null,null,null,null,"From the equation",null,"Soil location vs line"]
[null,null,null,null,null,null,null,null,null,null,null,null,null,null,null,null,null,null,null,null,null,null,null,null,null,null,null,null,null,null,null,null,null,null,null,null,null,"Line","y","x"]
[null,null,null,null,null,null,null,null,null,null,null,null,null,null,null,null,null,null,"X","Y",null,null,"X","Y",null,null,"X","Y",null,null,"X","Y",null,null,null,null,null," 10-11",{"$f":"((AK132-AK131)/(AJ132-AJ131))*(AI141-AJ131)+AK131","v":-18.340197822100819},{"$f":"((AJ141-AK131)/((AK132-AK131)/(AJ132-AJ131)))+AJ131","v":30.555555555555593},{"$f":"IF($AI$141>AN139,\"right\",\"left\")","v":"right"},{"$f":"IF($AJ$141>AM139,\"upper\",\"lower\")","v":"upper"}," 10-11-2",{"$f":"IF(AND(AO140=\"left\",AP139=\"lower\"),1,0)","v":0},"G(G)"]
[null,null,null,null,null,null,null,null,null,null,null,null,null,null,null,null,null,"[2]",{"$f":"AJ117","v":20.465116279069768},{"$f":"AK117","v":0},null,"[5]",{"$f":"AJ120","v":59.420289855072461},{"$f":"AK120","v":0},null,"[7]",{"$f":"AJ122","v":19.311594202898554},{"$f":"AK122","v":33.448662334572887},null,"[3]",{"$f":"AJ118","v":22.321856197049883},{"$f":"AK118","v":5.4443550629315638},null,null,"x","y",null," 2-11",{"$f":"((AK117-AK132)/(AJ117-AJ132))*(AI141-AJ132)+AK132","v":189.22996027573367},{"$f":"((AJ141-AK117)/((AK132-AK117)/(AJ132-AJ117)))+AJ117","v":20.465116279069768},{"$f":"IF($AI$141>AN140,\"right\",\"left\")","v":"right"},{"$f":"IF($AJ$141>AM140,\"upper\",\"lower\")","v":"lower"}]
[null,null,null,null,null,null,null,null,null,null,null,null,null,null,null,null,null,"[3]",{"$f":"AJ118","v":22.321856197049883},{"$f":"AK118","v":5.4443550629315638},null,"[6]",{"$f":"AJ121","v":58.48879134660605},{"$f":"AK121","v":8.5634453326810327},null,"[9]",{"$f":"AJ124","v":51.247551149260786},{"$f":"AK124","v":19.004542670551178},null,"[6]",{"$f":"AJ121","v":58.48879134660605},{"$f":"AK121","v":8.5634453326810327},null,null,{"$f":"S97","v":85},{"$f":"T97","v":0},null," 11-12",{"$f":"((AK133-AK132)/(AJ133-AJ132))*(AI141-AJ132)+AK132","v":6.1555102530676855},{"$f":"((AJ141-AK132)/((AK133-AK132)/(AJ133-AJ132)))+AJ132","v":-40.807331951782075},"right","lower"," 1-3-11-10",{"$f":"IF(AND(AO144=\"left\",AP143=\"lower\",AP139=\"upper\"),1,0)","v":0},"G(F)"]
[null,null,null,null,null,null,null,null,null,null,null,null,null,null,null,null,null,"[1]",{"$f":"AJ116","v":8.4420567920184197},{"$f":"AK116","v":14.622071284157828},null,"[4]",{"$f":"AJ119","v":92.20576773187841},{"$f":"AK119","v":13.500006294379403},null,"[8]",{"$f":"AJ123","v":82.365303782957582},{"$f":"AK123","v":30.544189823960139},null,"[8]",{"$f":"AJ124","v":51.247551149260786},{"$f":"AK124","v":19.004542670551178},null,null,null,null,null," 12-13",{"$f":"((AK134-AK133)/(AJ134-AJ133))*(AI141-AJ133)+AK133","v":7.0407670420521269},{"$f":"((AJ141-AK133)/((AK134-AK133)/(AJ134-AJ133)))+AJ133","v":-1.7763568394002505E-13},"right","lower"]
[null,null,null,null,null,null,null,null,null,null,null,null,null,null,null,null,null,null,null,null,null,null,null,null,null,null,null,null,null,"[3]",{"$f":"AJ118","v":22.321856197049883},{"$f":"AK118","v":5.4443550629315638},null,null,null,null,null," 1-3",{"$f":"((AK118-AK116)/(AJ118-AJ116))*(AI141-AJ116)+AK116","v":-36.000207665270473},{"$f":"((AJ141-AK116)/((AK118-AK116)/(AJ118-AJ116)))+AJ116","v":30.555555555555529},"right","upper"," 7-9-3-1",{"$f":"IF(AND(AO148=\"left\",AP149=\"lower\",AP143=\"upper\"),1,0)","v":0},"GF(F)"]
[null,null,null,null,null,null,null,null,null,null,null,null,null,null,null,null,null,null,null,null,null,null,null,null,null,null,null,null,null,null,null,null,null,null,null,null,null," 11-3",{"$f":"((AK118-AK132)/(AJ118-AJ132))*(AI141-AJ132)+AK132","v":189.22996027573396},{"$f":"((AJ141-AK132)/((AK118-AK132)/(AJ118-AJ132)))+AJ132","v":20.465116279069768},"right","lower"]
[null,null,null,null,null,null,null,null,null,null,null,null,null,null,null,null,null,null,null,null,null,null,null,null,null,null,null,null,null,null,null,null,null,null,null,null,null," 3-6",{"$f":"((AK121-AK118)/(AJ121-AJ118))*(AI141-AJ118)+AK118","v":10.849811390743703},{"$f":"((AJ141-AK118)/((AK121-AK118)/(AJ121-AJ118)))+AJ118","v":-40.807331951781563},"right","lower"," 2-11-12-5",{"$f":"IF(AND(AO140=\"right\",AO152=\"left\",AP141=\"lower\"),1,0)","v":0},"GS(S)",null,"SOIL CLASSIFICATION"]
[null,null,null,null,null,null,null,null,null,null,null,null,null,null,null,null,null,null,"X","Y","FF [%]",null,"G-S ",null,null,null,null,null,null,null,null,null,null,null,null,null,null," 6-12",{"$f":"((AK133-AK121)/(AJ133-AJ121))*(AI141-AJ121)+AK121","v":-235.15920579685132},{"$f":"((AJ141-AK121)/((AK133-AK121)/(AJ133-AJ121)))+AJ121","v":59.420289855072461},"right","upper",null,null,null,null,"Mechanical C. (Fluid flow class)"]
[null,null,null,null,null,null,null,null,null,null,null,null,null,null,null,null,null,"[10]",{"$f":"AJ131","v":4.9750643022143812},8.6170641423575116,{"$f":"AH131","v":9.9501286044287625},null," [11]",{"$f":"AJ132","v":21.504883039785135},{"$f":"AK132","v":3.0488165699194503},null,null,null,null,null,null,null,null,null,null,null,null," 6-4",{"$f":"((AK119-AK121)/(AJ119-AJ121))*(AI141-AJ121)+AK121","v":12.444997349395992},{"$f":"((AJ141-AK121)/((AK119-AK121)/(AJ119-AJ121)))+AJ121","v":-6.3948846218409017E-14},"right","lower"," 11-3-6-12-11",{"$f":"IF(AND(AO144=\"right\",AO146=\"left\",AP145=\"lower\",AP141=\"upper\"),1,0)","v":0},"GS(F)",null,{"$f":"VLOOKUP(1,AR139:AS158,2,)","v":"S(S)"}]
[null,null,null,null,null,null,null,null,null,null,null,null,null,null,null,null,null,"[11]",21.504883039785135,3.0488165699194503,{"$f":"AH132","v":3.5204701347055725},null,"[2]",{"$f":"AJ117","v":20.465116279069768},{"$f":"AK117","v":0},null,null,null,null,null,null,null,null,null,null,null,null," 3-9",{"$f":"((AK124-AK118)/(AJ124-AJ118))*(AI141-AJ118)+AK118","v":34.827482772380115},{"$f":"((AJ141-AK118)/((AK124-AK118)/(AJ124-AJ118)))+AJ118","v":10.708318219640725},"right","lower"]
[null,null,null,null,null,null,null,null,null,null,null,null,null,null,null,null,null,"[12]",58.889681736322849,4.8779827092475454,{"$f":"AH133","v":5.6326092605728206},null,null,null,null,null,null,null,null,null,null,null,null,null,null,null,null," 7-9",{"$f":"((AK124-AK122)/(AJ124-AJ122))*(AI141-AJ122)+AK122","v":3.7388529349134885},{"$f":"((AJ141-AK122)/((AK124-AK122)/(AJ124-AJ122)))+AJ122","v":93.266606005459465},"left","lower"," 3-9-6-3",{"$f":"IF(AND(AO150=\"left\",AO148=\"right\",AP145=\"upper\"),1,0)","v":0},"GSF(F)"]
[null,null,null,null,null,null,null,null,null,null,null,null,null,null,null,null,null,"[13]",95.435929646186835,7.9052017421232659,{"$f":"AH134","v":9.1281407076263328},null,null,null,null,null,null,null,null,null,null,null,null,null,null,null,null," 9-6",{"$f":"((AK121-AK124)/(AJ121-AJ124))*(AI141-AJ124)+AK124","v":-29.662894707268538},{"$f":"((AJ141-AK124)/((AK121-AK124)/(AJ121-AJ124)))+AJ124","v":64.427818880222347},"right","upper"]
[null,null,null,null,null,null,null,null,null,null,null,null,null,null,null,null,null,null,null,null,null,null,null,null,null,null,null,null,null,null,null,null,null,null,null,null,null," 9-8",{"$f":"((AK123-AK124)/(AJ123-AJ124))*(AI141-AJ124)+AK124","v":31.521235469222052},{"$f":"((AJ141-AK124)/((AK123-AK124)/(AJ123-AJ124)))+AJ124","v":0},"right","lower"," 5-12-13",{"$f":"IF(AND(AO152=\"right\",AP142=\"lower\"),1,0)","v":1},"S(S)"]
[null,null,null,null,null,null,null,null,null,null,null,null,null,null,null,null,null,null,null,null,null,null,null,null,null,null,null,null,null,null,null,null,null,null,null,null,null," 12-5",{"$f":"((AK133-AK120)/(AJ133-AJ120))*(AI141-AJ120)+AK120","v":-235.15920579685215},{"$f":"((AJ141-AK120)/((AK133-AK120)/(AJ133-AJ120)))+AJ120","v":59.420289855072461},{"$f":"IF($AI$141>AN152,\"right\",\"left\")","v":"right"},{"$f":"IF($AJ$141>AM152,\"upper\",\"lower\")","v":"upper"}]
[null,null,null,null,null,null,null,null,null,null,null,null,null,null,null,null,null,null,null,null,null,null,null,null,null,null,null,null,null,null,null,null,null,null,null,null,null,null,null,null,null,null,"4-6-12-13",{"$f":"IF(AND(AO146=\"right\",AP147=\"lower\",AP142=\"upper\"),1,0)","v":0},"S(F)"]
[]
[null,null,null,null,null,null,null,null,null,null,null,null,null,null,null,null,null,null,null,null,null,null,null,null,null,null,null,null,null,null,null,null,null,null,null,null,null,null,null,null,null,null,"4-6-9-8",{"$f":"IF(AND(AO150=\"right\",AP151=\"lower\",AP147=\"upper\"),1,0)","v":0},"SF(F)"]
[]
[null,null,null,null,null,null,null,null,null,null,null,null,null,null,null,null,null,null,null,null,null,null,null,null,null,null,null,null,null,null,null,null,null,null,null,null,null,null,null,null,null,null," 7-9-8",{"$f":"IF(AND(AP149=\"upper\",AP151=\"upper\"),1,0)","v":0},"F(F)"]
[]
[]
[]
[]
[]
[]
[]
[]
[]
[]
[]
[]
[null,null,null,null,null,null,null,null,null,null,null,null,null,null,null,null,null,"A","B","C","X","Y",null,"A","B","C","X","Y",null,"A","B","C","X","Y"]
[null,null,null,null,null,null,null,null,null,null,null,null,null,null,null,null,null,0,0,100,{"$f":"S171+T171/2","v":50},{"$f":"SQRT(3)/2*T171","v":86.602540378443862},null,100,0,0,{"$f":"Y171+Z171/2","v":0},{"$f":"SQRT(3)/2*Z171","v":0},null,0,100,0,{"$f":"AE171+AF171/2","v":100},{"$f":"AF171*SQRT(3)/2","v":0}]
[null,null,null,null,null,null,null,null,null,null,null,null,null,null,null,null,null,0,100,0,{"$f":"S172+T172/2","v":100},{"$f":"SQRT(3)/2*T172","v":0},null,0,0,100,{"$f":"Y172+Z172/2","v":50},{"$f":"SQRT(3)/2*Z172","v":86.602540378443862},null,100,0,0,{"$f":"AE172+AF172/2","v":0},{"$f":"AF172*SQRT(3)/2","v":0}]
[null,null,null,null,null,null,null,null,null,null,null,null,null,null,null,null,null,10,0,90,{"$f":"S173+T173/2","v":45},{"$f":"SQRT(3)/2*T173","v":77.94228634059948},null,90,10,0,{"$f":"Y173+Z173/2","v":10},{"$f":"SQRT(3)/2*Z173","v":0},null,0,90,10,{"$f":"AE173+AF173/2","v":95},{"$f":"AF173*SQRT(3)/2","v":8.6602540378443855}]
[null,null,null,null,null,null,null,null,null,null,null,null,null,null,null,null,null,10,90,0,{"$f":"S174+T174/2","v":90},{"$f":"SQRT(3)/2*T174","v":0},null,0,10,90,{"$f":"Y174+Z174/2","v":55},{"$f":"SQRT(3)/2*Z174","v":77.94228634059948},null,90,0,10,{"$f":"AE174+AF174/2","v":5},{"$f":"AF174*SQRT(3)/2","v":8.6602540378443855}]
[null,null,null,null,null,null,null,null,null,null,null,null,null,null,null,null,null,20,0,80,40,69.282032302755084,null,80,20,0,20,0,null,0,80,20,90,17.320508075688771]
[null,null,null,null,null,null,null,null,null,null,null,null,null,null,null,null,null,20,80,0,80,0,null,0,20,80,60,69.282032302755084,null,80,0,20,10,17.320508075688771]
[null,null,null,null,null,null,null,null,null,null,null,null,null,null,null,null,null,30,0,70,35,60.621778264910702,null,70,30,0,30,0,null,0,70,30,85,25.980762113533157]
[null,null,null,null,null,null,null,null,null,null,null,null,null,null,null,null,null,30,70,0,70,0,null,0,30,70,65,60.621778264910702,null,70,0,30,15,25.980762113533157]
[null,null,null,null,null,null,null,null,null,null,null,null,null,null,null,null,null,40,0,60,30,51.961524227066313,null,60,40,0,40,0,null,0,60,40,80,34.641016151377542]
[null,null,null,null,null,null,null,null,null,null,null,null,null,null,null,null,null,40,60,0,60,0,null,0,40,60,70,51.961524227066313,null,60,0,40,20,34.641016151377542]
[null,null,null,null,null,null,null,null,null,null,null,null,null,null,null,null,null,50,0,50,25,43.301270189221931,null,50,50,0,50,0,null,0,50,50,75,43.301270189221931]
[null,null,null,null,null,null,null,null,null,null,null,null,null,null,null,null,null,50,50,0,50,0,null,0,50,50,75,43.301270189221931,null,50,0,50,25,43.301270189221931]
[null,null,null,null,null,null,null,null,null,null,null,null,null,null,null,null,null,60,0,40,20,34.641016151377542,null,40,60,0,60,0,null,0,40,60,70,51.961524227066313]
[null,null,null,null,null,null,null,null,null,null,null,null,null,null,null,null,null,60,40,0,40,0,null,0,60,40,80,34.641016151377542,null,40,0,60,30,51.961524227066313]
[null,null,null,null,null,null,null,null,null,null,null,null,null,null,null,null,null,70,0,30,15,25.980762113533157,null,30,70,0,70,0,null,0,30,70,65,60.621778264910702]
[null,null,null,null,null,null,null,null,null,null,null,null,null,null,null,null,null,70,30,0,30,0,null,0,70,30,85,25.980762113533157,null,30,0,70,35,60.621778264910702]
[null,null,null,null,null,null,null,null,null,null,null,null,null,null,null,null,null,80,0,20,10,17.320508075688771,null,20,80,0,80,0,null,0,20,80,60,69.282032302755084]
[null,null,null,null,null,null,null,null,null,null,null,null,null,null,null,null,null,80,20,0,20,0,null,0,80,20,90,17.320508075688771,null,20,0,80,40,69.282032302755084]
[null,null,null,null,null,null,null,null,null,null,null,null,null,null,null,null,null,90,0,10,5,8.6602540378443855,null,10,90,0,90,0,null,0,10,90,55,77.94228634059948]
[null,null,null,null,null,null,null,null,null,null,null,null,null,null,null,null,null,90,10,0,10,0,null,0,90,10,95,8.6602540378443855,null,10,0,90,45,77.94228634059948]